{"text_format":"3","workbook":"xlsx","n_sheets":7,"sheets":["Line by Line Field Definitions","Summary of Fraud and Abuse","Q1 Details","Q2 Details","Q3 Details","Q4 Details","Drop Downs"],"not_rendered":{"images":4,"macros":1,"external_links":1,"defined_names":4},"read":"whole","date_system":"1900"}

{"sheet":"Line by Line Field Definitions","index":0,"n_rows":42,"n_cols":2,"rows_kept":42}
["Field Name","Description"]
["Reporting Fiscal Year","State Fiscal Year in FY YYYY-YYYY format (ex: FY 2017-2018)"]
["Reporting Fiscal Quarter","Quarter in State Fiscal Year QQ format (ex: Q1)"]
["Medicaid Health Plan Identifier","Plan's 3 letter identifier assigned by the Agency"]
["New/Previously Reported","Quarter when complaint was first reported to MPI via the online complaint form"]
["Vendor Associated (If Applicable)","Indicate the type of vendor associated if applicable"]
["MPI Complaint ID","MPI's case tracking system complaint number"]
["Plan Internal Tracking Number","Plan's case/audit number"]
["Provider Type (Under Review)","Medicaid provider type"]
["Provider (Under Review) Tax ID","Provider's tax ID number"]
["Entity Under Review","Indicate whether a provider, recipient, health plan, or internal"]
["Provider/Entity Name","Full name of Provider or the Entity being reported (including any known \"d/b/a\")"]
["Entity Medicaid ID Number","Provider's Florida Medicaid ID number"]
["Provider NPI Number (If Applicable)","Provider's National Provider Identifier number"]
["Date Detected","Date issue was first detected by the health plan in format MM/DD/YYYY"]
["Date First Reported to MPI","Date the plan reported the issue to MPI through the online complaint form in format MM/DD/YYYY"]
["Allegation Type","Indicate whether Fraud or Abuse allegation"]
["Primary Allegation","Main type of fraud or abuse category being alleged"]
["Secondary Allegation (If Applicable)","Secondary type of fraud or abuse category being alleged"]
["Detection Tool","Indicate tool plan used to detect issue"]
{"$rows_left_out":23}
{"sheet":"Summary of Fraud and Abuse","index":1,"n_rows":39,"n_cols":11,"rows_kept":39,"merged":[[14,1,14,10],[16,1,16,2],[16,3,16,4],[16,5,16,6],[16,7,16,8],[16,9,16,10],[23,1,23,10],[25,1,25,2],[25,3,25,4],[25,5,25,6],[25,7,25,8],[25,9,25,10]]}
[]
[]
[]
[]
["Reporting Period"]
["Medicaid Health Plan"]
["Medicaid Health Plan Medicaid ID(s)"]
["Vendor-Dental Name:"]
["Vendor-Vision Name:"]
["Vendor-Transportation Name:"]
["Vendor-Behavioral Health Name:"]
["Vendor-Pharmacy Name:"]
[]
[]
[null,"Quarterly Fraud and Abuse Activity Report Health Plan Recovery Summary by Quarter"]
[]
[null,"Q1 Recoveries",null,"Q2 Recoveries",null,"Q3 Recoveries",null,"Q4 Recoveries",null,"YTD Recoveries"]
["Recovery Category","Identified $","Recovered $","Identified $","Recovered $","Identified $","Recovered $","Identified $","Recovered $","Identified $","Recovered $"]
["Medicaid Health Plan Initiated Audit Recoveries",null,{"$f":"(SUM('Q1 Details'!$AA$2:$AA$750)-C20)","v":{"v":0,"d":"$0.00"}},null,{"$f":"(SUM('Q2 Details'!$AA$2:$AA$750)-E20)","v":{"v":0,"d":"$0.00"}},null,{"$f":"(SUM('Q3 Details'!$AA$2:$AA$750)-G20)","v":{"v":0,"d":"$0.00"}},null,{"$f":"(SUM('Q4 Details'!$AA$2:$AA$750)-I20)","v":{"v":0,"d":"$0.00"}},{"$f":"SUM(B19,D19,F19,H19)","v":{"v":0,"d":"$0.00"}},{"$f":"SUM(C19,E19,G19,I19)","v":{"v":0,"d":"$0.00"}}]
["AHCA Referral Recoveries",null,{"$f":"(SUMIFS('Q1 Details'!$AA$2:$AA$750, 'Q1 Details'!$S$2:$S$750, \"AHCA - source of referral\") + SUMIFS('Q1 Details'!$AA$2:$AA$750, 'Q1 Details'!$S$2:$S$750, \"AHCA - MPI\"))","v":{"v":0,"d":"$0.00"}},null,{"$f":"(SUMIFS('Q2 Details'!$AA$2:$AA$750,   'Q2 Details'!$S$2:$S$750, \"AHCA - source of referral\") + SUMIFS('Q2 Details'!$AA$2:$AA$750,    'Q2 Details'!$S$2:$S$750, \"AHCA - MPI\"))","v":{"v":0,"d":"$0.00"}},null,{"$f":"(SUMIFS('Q3 Details'!$AA$2:$AA$750,  'Q3 Details'!$S$2:$S$750, \"AHCA - source of referral\") + SUMIFS('Q3 Details'!$AA$2:$AA$750,   'Q3 Details'!$E$2:$E$750, \"\", 'Q3 Details'!$S$2:$S$750, \"AHCA - MPI\"))","v":{"v":0,"d":"$0.00"}},null,{"$f":"(SUMIFS('Q4 Details'!$AA$2:$AA$750, 'Q4 Details'!$S$2:$S$750, \"AHCA - source of referral\") + SUMIFS('Q4 Details'!$AA$2:$AA$750,   'Q4 Details'!$E$2:$E$750, \"\", 'Q4 Details'!$S$2:$S$750, \"AHCA - MPI\"))","v":{"v":0,"d":"$0.00"}},{"$f":"SUM(B20,D20,F20,H20)","v":{"v":0,"d":"$0.00"}},{"v":0,"d":"$0.00"}]
{"$rows_left_out":20}
{"sheet":"Q1 Details","index":2,"n_rows":749,"n_cols":41,"rows_kept":749}
["Reporting Fiscal Year","Reporting Fiscal Quarter","Medicaid Health Plan Identifier","New/Previously Reported","Vendor Associated (If Applicable)","MPI Complaint ID","Plan Internal Tracking Number","Provider Type (Under Review)","Provider (Under Review) Tax ID","Entity Under Review","Provider/Entity Name","Entity Medicaid ID Number","Provider NPI Number (If Applicable)","Date Detected","Date First Reported to MPI","Allegation Type","Primary Allegation","Secondary Allegation (If Applicable)","Detection Tool","Preliminary Overpayment Identified","Updated Overpayment Amount Identified","Final Overpayment Identified for Recovery","Fines Amount (If Applicable)","Sanctions Amount (If Applicable)","Other Financial Penalties (If Applicable)","Settlement Amount (If Applicable)","Recoupment Amount (If Applicable)","Dollar Amount Lost (If Applicable)","Status","Other Entity Reported To Primary","Other Entity Reported To Secondary","Other Entity Reported To Tertiary","Other Entity Reported To Quaternary","Corrective Action","Times Provider Reviewed Within Last 5 Years","Detailed Update","Additional Comments for Primary Allegation ","Additional Comments for Secondary Allegation","Additional Comments for Detection Tool","Additional Comments for Status","Additional Comments for Corrective Action"]
[null,{"$f":"IF(NOT(ISBLANK(D2)), \"Q1\", \"\")","v":""},{"$f":"IF(NOT(ISBLANK(D2)), 'Summary of Fraud and Abuse'!$B$6, \"\")","v":""}]
[null,{"$f":"IF(NOT(ISBLANK(D3)), \"Q1\", \"\")","v":""},{"$f":"IF(NOT(ISBLANK(D3)), 'Summary of Fraud and Abuse'!$B$6, \"\")","v":""}]
[null,"",{"$f":"IF(NOT(ISBLANK(D4)), 'Summary of Fraud and Abuse'!$B$6, \"\")","v":""}]
[null,"",{"$f":"IF(NOT(ISBLANK(D5)), 'Summary of Fraud and Abuse'!$B$6, \"\")","v":""}]
[null,"",{"$f":"IF(NOT(ISBLANK(D6)), 'Summary of Fraud and Abuse'!$B$6, \"\")","v":""}]
[null,"",{"$f":"IF(NOT(ISBLANK(D7)), 'Summary of Fraud and Abuse'!$B$6, \"\")","v":""}]
[null,"",{"$f":"IF(NOT(ISBLANK(D8)), 'Summary of Fraud and Abuse'!$B$6, \"\")","v":""}]
[null,"",{"$f":"IF(NOT(ISBLANK(D9)), 'Summary of Fraud and Abuse'!$B$6, \"\")","v":""}]
[null,"",{"$f":"IF(NOT(ISBLANK(D10)), 'Summary of Fraud and Abuse'!$B$6, \"\")","v":""}]
[null,"",{"$f":"IF(NOT(ISBLANK(D11)), 'Summary of Fraud and Abuse'!$B$6, \"\")","v":""}]
[null,"",{"$f":"IF(NOT(ISBLANK(D12)), 'Summary of Fraud and Abuse'!$B$6, \"\")","v":""}]
[null,"",{"$f":"IF(NOT(ISBLANK(D13)), 'Summary of Fraud and Abuse'!$B$6, \"\")","v":""}]
[null,"",{"$f":"IF(NOT(ISBLANK(D14)), 'Summary of Fraud and Abuse'!$B$6, \"\")","v":""}]
[null,"",{"$f":"IF(NOT(ISBLANK(D15)), 'Summary of Fraud and Abuse'!$B$6, \"\")","v":""}]
[null,"",{"$f":"IF(NOT(ISBLANK(D16)), 'Summary of Fraud and Abuse'!$B$6, \"\")","v":""}]
[null,"",{"$f":"IF(NOT(ISBLANK(D17)), 'Summary of Fraud and Abuse'!$B$6, \"\")","v":""}]
[null,"",{"$f":"IF(NOT(ISBLANK(D18)), 'Summary of Fraud and Abuse'!$B$6, \"\")","v":""}]
[null,"",{"$f":"IF(NOT(ISBLANK(D19)), 'Summary of Fraud and Abuse'!$B$6, \"\")","v":""}]
[null,"",{"$f":"IF(NOT(ISBLANK(D20)), 'Summary of Fraud and Abuse'!$B$6, \"\")","v":""}]
{"$rows_left_out":730}
{"sheet":"Q2 Details","index":3,"n_rows":750,"n_cols":41,"rows_kept":750}
["Reporting Fiscal Year","Reporting Fiscal Quarter","Medicaid Health Plan Identifier","New/Previously Reported","Vendor Associated (If Applicable)","MPI Complaint ID","Plan Internal Tracking Number","Provider Type (Under Review)","Provider (Under Review) Tax ID","Entity Under Review","Provider/Entity Name","Entity Medicaid ID Number","Provider NPI Number (If Applicable)","Date Detected","Date First Reported to MPI","Allegation Type","Primary Allegation","Secondary Allegation (If Applicable)","Detection Tool","Preliminary Overpayment Identified","Updated Overpayment Amount Identified","Final Overpayment Identified for Recovery","Fines Amount (If Applicable)","Sanctions Amount (If Applicable)","Other Financial Penalties (If Applicable)","Settlement Amount (If Applicable)","Recoupment Amount (If Applicable)","Dollar Amount Lost (If Applicable)","Status","Other Entity Reported To Primary","Other Entity Reported To Secondary","Other Entity Reported To Tertiary","Other Entity Reported To Quaternary","Corrective Action","Times Provider Reviewed Within Last 5 Years","Detailed Update","Additional Comments for Primary Allegation ","Additional Comments for Secondary Allegation","Additional Comments for Detection Tool","Additional Comments for Status","Additional Comments for Corrective Action"]
[null,{"$f":"IF(NOT(ISBLANK(D2)), \"Q2\", \"\")","v":""},{"$f":"IF(NOT(ISBLANK(D2)), 'Summary of Fraud and Abuse'!$B$6, \"\")","v":""}]
[null,{"$f":"IF(NOT(ISBLANK(D3)), \"Q2\", \"\")","v":""},{"$f":"IF(NOT(ISBLANK(D3)), 'Summary of Fraud and Abuse'!$B$6, \"\")","v":""}]
[null,"",{"$f":"IF(NOT(ISBLANK(D4)), 'Summary of Fraud and Abuse'!$B$6, \"\")","v":""}]
[null,"",{"$f":"IF(NOT(ISBLANK(D5)), 'Summary of Fraud and Abuse'!$B$6, \"\")","v":""}]
[null,"",{"$f":"IF(NOT(ISBLANK(D6)), 'Summary of Fraud and Abuse'!$B$6, \"\")","v":""}]
[null,"",{"$f":"IF(NOT(ISBLANK(D7)), 'Summary of Fraud and Abuse'!$B$6, \"\")","v":""}]
[null,"",{"$f":"IF(NOT(ISBLANK(D8)), 'Summary of Fraud and Abuse'!$B$6, \"\")","v":""}]
[null,"",{"$f":"IF(NOT(ISBLANK(D9)), 'Summary of Fraud and Abuse'!$B$6, \"\")","v":""}]
[null,"",{"$f":"IF(NOT(ISBLANK(D10)), 'Summary of Fraud and Abuse'!$B$6, \"\")","v":""}]
[null,"",{"$f":"IF(NOT(ISBLANK(D11)), 'Summary of Fraud and Abuse'!$B$6, \"\")","v":""}]
[null,"",{"$f":"IF(NOT(ISBLANK(D12)), 'Summary of Fraud and Abuse'!$B$6, \"\")","v":""}]
[null,"",{"$f":"IF(NOT(ISBLANK(D13)), 'Summary of Fraud and Abuse'!$B$6, \"\")","v":""}]
[null,"",{"$f":"IF(NOT(ISBLANK(D14)), 'Summary of Fraud and Abuse'!$B$6, \"\")","v":""}]
[null,"",{"$f":"IF(NOT(ISBLANK(D15)), 'Summary of Fraud and Abuse'!$B$6, \"\")","v":""}]
[null,"",{"$f":"IF(NOT(ISBLANK(D16)), 'Summary of Fraud and Abuse'!$B$6, \"\")","v":""}]
[null,"",{"$f":"IF(NOT(ISBLANK(D17)), 'Summary of Fraud and Abuse'!$B$6, \"\")","v":""}]
[null,"",{"$f":"IF(NOT(ISBLANK(D18)), 'Summary of Fraud and Abuse'!$B$6, \"\")","v":""}]
[null,"",{"$f":"IF(NOT(ISBLANK(D19)), 'Summary of Fraud and Abuse'!$B$6, \"\")","v":""}]
[null,"",{"$f":"IF(NOT(ISBLANK(D20)), 'Summary of Fraud and Abuse'!$B$6, \"\")","v":""}]
{"$rows_left_out":731}
{"sheet":"Q3 Details","index":4,"n_rows":750,"n_cols":41,"rows_kept":750}
["Reporting Fiscal Year","Reporting Fiscal Quarter","Medicaid Health Plan Identifier","New/Previously Reported","Vendor Associated (If Applicable)","MPI Complaint ID","Plan Internal Tracking Number","Provider Type (Under Review)","Provider (Under Review) Tax ID","Entity Under Review","Provider/Entity Name","Entity Medicaid ID Number","Provider NPI Number (If Applicable)","Date Detected","Date First Reported to MPI","Allegation Type","Primary Allegation","Secondary Allegation (If Applicable)","Detection Tool","Preliminary Overpayment Identified","Updated Overpayment Amount Identified","Final Overpayment Identified for Recovery","Fines Amount (If Applicable)","Sanctions Amount (If Applicable)","Other Financial Penalties (If Applicable)","Settlement Amount (If Applicable)","Recoupment Amount (If Applicable)","Dollar Amount Lost (If Applicable)","Status","Other Entity Reported To Primary","Other Entity Reported To Secondary","Other Entity Reported To Tertiary","Other Entity Reported To Quaternary","Corrective Action","Times Provider Reviewed Within Last 5 Years","Detailed Update","Additional Comments for Primary Allegation ","Additional Comments for Secondary Allegation","Additional Comments for Detection Tool","Additional Comments for Status","Additional Comments for Corrective Action"]
[null,{"$f":"IF(NOT(ISBLANK(D2)), \"Q3\", \"\")","v":""},{"$f":"IF(NOT(ISBLANK(D2)), 'Summary of Fraud and Abuse'!$B$6, \"\")","v":""}]
[null,"",{"$f":"IF(NOT(ISBLANK(D3)), 'Summary of Fraud and Abuse'!$B$6, \"\")","v":""}]
[null,"",{"$f":"IF(NOT(ISBLANK(D4)), 'Summary of Fraud and Abuse'!$B$6, \"\")","v":""}]
[null,"",{"$f":"IF(NOT(ISBLANK(D5)), 'Summary of Fraud and Abuse'!$B$6, \"\")","v":""}]
[null,"",{"$f":"IF(NOT(ISBLANK(D6)), 'Summary of Fraud and Abuse'!$B$6, \"\")","v":""}]
[null,"",{"$f":"IF(NOT(ISBLANK(D7)), 'Summary of Fraud and Abuse'!$B$6, \"\")","v":""}]
[null,"",{"$f":"IF(NOT(ISBLANK(D8)), 'Summary of Fraud and Abuse'!$B$6, \"\")","v":""}]
[null,"",{"$f":"IF(NOT(ISBLANK(D9)), 'Summary of Fraud and Abuse'!$B$6, \"\")","v":""}]
[null,"",{"$f":"IF(NOT(ISBLANK(D10)), 'Summary of Fraud and Abuse'!$B$6, \"\")","v":""}]
[null,"",{"$f":"IF(NOT(ISBLANK(D11)), 'Summary of Fraud and Abuse'!$B$6, \"\")","v":""}]
[null,"",{"$f":"IF(NOT(ISBLANK(D12)), 'Summary of Fraud and Abuse'!$B$6, \"\")","v":""}]
[null,"",{"$f":"IF(NOT(ISBLANK(D13)), 'Summary of Fraud and Abuse'!$B$6, \"\")","v":""}]
[null,"",{"$f":"IF(NOT(ISBLANK(D14)), 'Summary of Fraud and Abuse'!$B$6, \"\")","v":""}]
[null,"",{"$f":"IF(NOT(ISBLANK(D15)), 'Summary of Fraud and Abuse'!$B$6, \"\")","v":""}]
[null,{"$f":"IF(NOT(ISBLANK(D16)), \"Q3\", \"\")","v":""},{"$f":"IF(NOT(ISBLANK(D16)), 'Summary of Fraud and Abuse'!$B$6, \"\")","v":""}]
[null,"",{"$f":"IF(NOT(ISBLANK(D17)), 'Summary of Fraud and Abuse'!$B$6, \"\")","v":""}]
[null,"",{"$f":"IF(NOT(ISBLANK(D18)), 'Summary of Fraud and Abuse'!$B$6, \"\")","v":""}]
[null,"",{"$f":"IF(NOT(ISBLANK(D19)), 'Summary of Fraud and Abuse'!$B$6, \"\")","v":""}]
[null,"",{"$f":"IF(NOT(ISBLANK(D20)), 'Summary of Fraud and Abuse'!$B$6, \"\")","v":""}]
{"$rows_left_out":731}
{"sheet":"Q4 Details","index":5,"n_rows":750,"n_cols":41,"rows_kept":750}
["Reporting Fiscal Year","Reporting Fiscal Quarter","Medicaid Health Plan Identifier","New/Previously Reported","Vendor Associated (If Applicable)","MPI Complaint ID","Plan Internal Tracking Number","Provider Type (Under Review)","Provider (Under Review) Tax ID","Entity Under Review","Provider/Entity Name","Entity Medicaid ID Number","Provider NPI Number (If Applicable)","Date Detected","Date First Reported to MPI","Allegation Type","Primary Allegation","Secondary Allegation (If Applicable)","Detection Tool","Preliminary Overpayment Identified","Updated Overpayment Amount Identified","Final Overpayment Identified for Recovery","Fines Amount (If Applicable)","Sanctions Amount (If Applicable)","Other Financial Penalties (If Applicable)","Settlement Amount (If Applicable)","Recoupment Amount (If Applicable)","Dollar Amount Lost (If Applicable)","Status","Other Entity Reported To Primary","Other Entity Reported To Secondary","Other Entity Reported To Tertiary","Other Entity Reported To Quaternary","Corrective Action","Times Provider Reviewed Within Last 5 Years","Detailed Update","Additional Comments for Primary Allegation ","Additional Comments for Secondary Allegation","Additional Comments for Detection Tool","Additional Comments for Status","Additional Comments for Corrective Action"]
[null,{"$f":"IF(NOT(ISBLANK(D2)), \"Q4\", \"\")","v":""},{"$f":"IF(NOT(ISBLANK(D2)), 'Summary of Fraud and Abuse'!$B$6, \"\")","v":""}]
[null,{"$f":"IF(NOT(ISBLANK(D3)), \"Q4\", \"\")","v":""},{"$f":"IF(NOT(ISBLANK(D3)), 'Summary of Fraud and Abuse'!$B$6, \"\")","v":""}]
[null,"",{"$f":"IF(NOT(ISBLANK(D4)), 'Summary of Fraud and Abuse'!$B$6, \"\")","v":""}]
[null,"",{"$f":"IF(NOT(ISBLANK(D5)), 'Summary of Fraud and Abuse'!$B$6, \"\")","v":""}]
[null,"",{"$f":"IF(NOT(ISBLANK(D6)), 'Summary of Fraud and Abuse'!$B$6, \"\")","v":""}]
[null,"",{"$f":"IF(NOT(ISBLANK(D7)), 'Summary of Fraud and Abuse'!$B$6, \"\")","v":""}]
[null,"",{"$f":"IF(NOT(ISBLANK(D8)), 'Summary of Fraud and Abuse'!$B$6, \"\")","v":""}]
[null,"",{"$f":"IF(NOT(ISBLANK(D9)), 'Summary of Fraud and Abuse'!$B$6, \"\")","v":""}]
[null,"",{"$f":"IF(NOT(ISBLANK(D10)), 'Summary of Fraud and Abuse'!$B$6, \"\")","v":""}]
[null,"",{"$f":"IF(NOT(ISBLANK(D11)), 'Summary of Fraud and Abuse'!$B$6, \"\")","v":""}]
[null,"",{"$f":"IF(NOT(ISBLANK(D12)), 'Summary of Fraud and Abuse'!$B$6, \"\")","v":""}]
[null,"",{"$f":"IF(NOT(ISBLANK(D13)), 'Summary of Fraud and Abuse'!$B$6, \"\")","v":""}]
[null,"",{"$f":"IF(NOT(ISBLANK(D14)), 'Summary of Fraud and Abuse'!$B$6, \"\")","v":""}]
[null,"",{"$f":"IF(NOT(ISBLANK(D15)), 'Summary of Fraud and Abuse'!$B$6, \"\")","v":""}]
[null,"",{"$f":"IF(NOT(ISBLANK(D16)), 'Summary of Fraud and Abuse'!$B$6, \"\")","v":""}]
[null,"",{"$f":"IF(NOT(ISBLANK(D17)), 'Summary of Fraud and Abuse'!$B$6, \"\")","v":""}]
[null,"",{"$f":"IF(NOT(ISBLANK(D18)), 'Summary of Fraud and Abuse'!$B$6, \"\")","v":""}]
[null,"",{"$f":"IF(NOT(ISBLANK(D19)), 'Summary of Fraud and Abuse'!$B$6, \"\")","v":""}]
[null,"",{"$f":"IF(NOT(ISBLANK(D20)), 'Summary of Fraud and Abuse'!$B$6, \"\")","v":""}]
{"$rows_left_out":731}
{"sheet":"Drop Downs","index":6,"n_rows":62,"n_cols":7,"rows_kept":62,"hidden":true}
[null,null,"Reporting Fiscal Quarter",null,"Provider Type",null,"Entity Under Review"]
[null,null,"Q1",null,"01 - GENERAL HOSPITAL                                  ",null,"Provider"]
[null,null,"Q2",null,"05 - COMMUNITY BEHAVORIAL HEALTH SERVICES              ",null,"Recipient"]
[null,null,"Q3",null,"06 - AMBULATORY SURGERY CENTER                         ",null,"Internal"]
[null,null,"Q4",null,"07 - SPECIALIZED MENTAL HEALTH PRACTITIONER            ",null,"Health Plan"]
[{"$nulls":4},"08 - SCHOOL DISTRICT                                   "]
[{"$nulls":4},"09 - SKILLED NURSING UNIT HOSPITAL BASED               ",null,"Corrective Action"]
["Primary Allegation",null,"Secondary Allegation",null,"10 - SKILLED NURSING FACILITY                          ",null,"Education"]
["Kickbacks",null,"Kickbacks",null,"13 - SWING BED FACILITY                                ",null,"Fines/Sanctions"]
["Other - (describe in narrative field)",null,"Other - (describe in narrative field)",null,"14 - ASSISTIVE CARE SERVICES                           ",null,"Recoupment"]
["Provider - Altering, falsifying, or destroying clinical record documentation",null,"Provider - Altering, falsifying, or destroying clinical record documentation",null,"15 - HOSPICE                                           ",null,"Settlement"]
["Provider - Billing excessive services",null,"Provider - Billing excessive services",null,"16 - RESIDENTIAL AND FREESTANDING PSYCH                ",null,"Termination - Voluntary"]
["Provider - Billing for services not rendered",null,"Provider - Billing for services not rendered",null,"20 - PHARMACY                                          ",null,"Termination - Involuntary"]
["Provider - Billing for services that are medically unnecessary",null,"Provider - Billing for services that are medically unnecessary",null,"23 - MEDICAL FOSTER CARE/ PERSONAL CARE PROVIDER       ",null,"Other (describe in narrative field)"]
["Provider - Charging enrollees for covered services",null,"Provider - Charging enrollees for covered services",null,"24 - PRESCRIBED MEDICAL REHAB SERVICES (PPEC)          "]
["Provider - Disenrollment issues",null,"Provider - Disenrollment issues",null,"25 - PHYSICIAN (M.D.)                                  "]
["Provider - Failing to render medically necessary services",null,"Provider - Failing to render medically necessary services",null,"26 - PHYSICIAN (D.O.)                                  ",null,"Detection Tools"]
["Provider - False statements related to credentials",null,"Provider - False statements related to credentials",null,"27 - PODIATRIST                                        ",null,"AHCA - source of referral"]
["Provider - Federally Excluded Provider",null,"Provider - Federally Excluded Provider",null,"28 - CHIROPRACTOR                                      ",null,"AHCA - MPI"]
["Provider - Marketing violations",null,"Provider - Marketing violations",null,"29 - PHYSICIAN ASSISTANT                               ",null,"Claims Edits"]
{"$rows_left_out":42}