{"text_format":"3","workbook":"xlsx","n_sheets":18,"sheets":["General Instructions","Audited Financial Requirements","Plan Benefit Packages (PBP)","Changes","Index","County Grouping Table","Jurat","DSNP Rev-Exp Instructions","DSNP Rev-Exp Summary","StartSum","DSNP Rev-Exp Rest of Florida","DSNP Rev-Exp Region 9","DSNP Rev-Exp Region 10","DSNP Rev-Exp Region 11","EndSum","DSNP Admin Summary","DSNP Subcap Summary","Notes"],"not_rendered":{"images":1,"macros":1,"defined_names":19,"comments":1},"read":"whole","date_system":"1900"}

{"sheet":"General Instructions","index":0,"n_rows":52,"n_cols":2,"rows_kept":52,"merged":[[5,0,10,14],[13,1,15,14],[17,1,18,14],[20,1,26,14],[28,1,30,14],[32,1,34,14],[36,1,38,14],[41,1,42,14],[45,1,46,14],[48,1,49,14],[51,1,52,14]]}
["DUAL SPECIAL NEEDS PLAN (DSNP)"]
["FINANCIAL REPORT - GENERAL INSTRUCTIONS"]
["This template contains predetermined formulas in certain cells which are locked by the Agency. Please only fill out the cells shadowed in light blue color in each tab."]
[]
["Annual DSNP Financial Report"]
["Annual DSNP Financial Reports are due to the Agency by July 1st following the end of the reporting calendar year, allowing for three months of runout.  However, the first DSNP Financial Report is due to the Agency on January 4, 2019 for the calendar year 2017 reporting period, with claims paid through March 31. Effective with the calendar year 2019 reporting period, the Annual DSNP Financial Report is required to be examined by an independent certified public accountant. If a DSNP Plan’s revenue or medical expense across the State of Florida during the calendar year is less than $250,000, the Agency will waive the examination requirement for the plan and the plan will just submit an unaudited report. Refer to the Audited Financial Requirements tab for more detailed instructions."]
[]
[]
[]
[]
{"$rows_left_out":37}
{"sheet":"Audited Financial Requirements","index":1,"n_rows":36,"n_cols":2,"rows_kept":36,"merged":[[4,0,9,14],[12,1,13,14],[15,1,15,15],[17,1,20,14],[23,1,23,15],[25,1,25,15],[27,1,27,15],[30,1,32,14],[35,1,36,14]]}
["DUAL SPECIAL NEEDS PLAN (DSNP)"]
["FINANCIAL REPORT - AUDITED FINANCIAL REQUIREMENTS"]
[]
["Annual Audited DSNP Financial Report"]
["Effective with the calendar year 2019 reporting period, the Annual DSNP Financial Report is required to be examined by an independent certified public accountant. The Plan shall contract with independent certified public accountants to perform an Examination in accordance with Attestation standards, including but not limited to: annual premium revenue, medical and administrative costs, and income or losses reported by each prepaid plan. The Annual Audited DSNP Financial Report submission will require 4 items to be submitted: an Attestation, Examination, Jurat, and the Annual Audited DSNP Financial Report. Annual Audited DSNP Financial Report submission are due to the Agency by September 15th following the end of the reporting calendar year."]
[]
[]
[]
[]
[]
{"$rows_left_out":27}
{"sheet":"Plan Benefit Packages (PBP)","index":2,"n_rows":17,"n_cols":3,"rows_kept":17}
["DUAL SPECIAL NEEDS PLAN (DSNP) - Plan Benefit Packages (PBP)"]
[]
["Instructions:  In the yellow fields below, please enter the number of Plan Benefit Packages (PBP) that the Plan offers to Medicaid recipients it serves under the DSNP contract held with the Agency.  Please divide by Rest of Florida, Region 9, Region 10, "]
["                           and Region 11, as defined in \"County Grouping Table\" tab. After entering the correct number of PBPs, press the \"Populate Template with PBPs\" button to populate the template with the correct number of "]
["                          \"DSNP Rev-Exp Rest of Florida\", \"DSNP Rev-Exp Region 9\", \"DSNP Rev-Exp Region 10\" , and \"DSNP Rev-Exp Region 11\" tabs that the Plan will be required to submit at a PBP level. "]
["                           Once PBP sheets are populated, please add the correct PBP identifier in cell C4 of each sheet that aligns with the Plan's financials."]
[]
["1.)","# of Plan Benefit Packages (PBP) - Rest of Florida",0]
[]
[]
{"$rows_left_out":8}
{"sheet":"Changes","index":3,"n_rows":8,"n_cols":3,"rows_kept":8}
["DSNP FINANCIAL REPORT - CHANGE LOG"]
[]
["Current Version:",null,"DSNP Financial Report Template_09142023 version"]
["Previous Version:",null,"DSNP Financial Report_08292023"]
[]
["Changes effective September 2023 with the current version:"]
["1. Replaced \"South Florida\" tabs with \"Region 9\", \"Region 10\", and \"Region 11\" tabs when populating new tabs due to regions split;"]
["2. Updated all relevant tabs to replace \"South Florida\" with \"Region 9\", \"Region 10\", and \"Region 11\"."]

{"sheet":"Index","index":4,"n_rows":18,"n_cols":3,"rows_kept":18}
["DSNP REVENUE AND EXPENSE STATEMENT - INDEX"]
[]
[]
["Section","Tab Name","Description"]
["General","General Instructions","Provides general instructions for the completion of the DSNP Revenue and Expense Statement.  Additional instructions can be found on the schedule-specific instructions."]
["General","Plan Benefit Packages (PBP)","Populates the template with the correct number of  \"DSNP Rev-Exp Rest of Florida\", \"DSNP Rev-Exp Region 9\",  \"DSNP Rev-Exp Region 10\", and \"DSNP Rev-Exp Region 11\"  tabs that the Plan will be required to submit at a PBP level."]
["General","Index","Listing of all tabs contained within the DSNP Revenue and Expense Statement."]
["General","County Grouping Table","Table 1 describes how the plan should separate the counties by Rest of Florida, Region 9, Region 10, and Region 11."]
["General","Jurat","Jurat Page."]
["DSNP","DSNP Rev-Exp Instructions","Detailed instructions for completion of the DSNP Rev-Exp Schedules."]
{"$rows_left_out":9}
{"sheet":"County Grouping Table","index":5,"n_rows":16,"n_cols":4,"rows_kept":16,"merged":[[1,1,1,3],[2,1,2,3],[3,1,3,3],[5,1,12,1],[13,1,15,1]]}
[]
[null,"Table 1"]
[null,"Dual Special Needs Plan Program"]
[null,"Grouping by County"]
[null,"Group","Region","Counties"]
[null,"Rest of Florida",1,"Escambia, Okaloosa, Santa Rosa, and Walton"]
[null,null,2,"Bay, Calhoun, Franklin, Gadsden, Gulf, Holmes, Jackson, Jefferson, Leon, Liberty, Madison, Taylor, Wakulla, and Washington"]
[null,null,3,"Alachua, Bradford, Citrus, Columbia, Dixie, Gilchrist, Hamilton, Hernando, Lafayette, Lake, Levy, Marion, Putnam, Sumter, Suwannee, and Union"]
[null,null,4,"Baker, Clay, Duval, Flagler, Nassau, St. Johns, and Volusia"]
[null,null,5,"Pasco and Pinellas"]
{"$rows_left_out":7}
{"sheet":"Jurat","index":6,"n_rows":40,"n_cols":8,"rows_kept":40,"merged":[[0,2,0,5],[1,2,1,6],[2,2,2,5],[3,2,3,6],[3,7,3,8],[4,2,4,5],[5,2,5,6],[7,2,7,4],[10,2,10,4],[11,2,11,6],[12,2,12,6],[13,2,13,5],[15,1,15,2],[15,4,15,7],[16,1,16,2],[16,4,16,7],[17,1,17,2],[17,4,17,7],[18,1,18,2],[18,4,18,7],[19,1,19,2],[19,4,19,7],[20,1,20,2],[20,4,20,7],[21,1,21,2],[21,4,21,7],[22,1,22,2],[22,4,22,7],[23,1,23,2],[23,4,23,7],[24,1,24,2],[24,4,24,7],[27,2,27,6],[32,3,32,4]]}
[null,null,"HEALTH PLAN NAME"]
[]
[null,null,"ADDRESS"]
[{"$nulls":7},"(street, city, zip)"]
[null,null,"PARENT COMPANY NAME"]
[]
[]
[null,"CONTACT PERSON:"]
[null,"TELEPHONE:"]
[null,"FAX:"]
{"$rows_left_out":31}
{"sheet":"DSNP Rev-Exp Instructions","index":7,"n_rows":90,"n_cols":4,"rows_kept":90,"merged":[[13,0,13,2],[14,0,15,2],[14,3,15,3],[16,0,18,0],[19,0,20,2],[19,3,20,3],[21,0,67,0],[68,0,71,0],[72,0,72,2],[73,0,79,0],[80,0,85,0]]}
["DUAL SPECIAL NEEDS PLAN REVENUE AND EXPENSE SCHEDULE - INSTRUCTIONS"]
["ANNUAL"]
[]
["Coverage:","Reported for DSNP experience, by region and by eligibility group. Summary report aggregates all contracted regions."]
["Reporting Period:"]
["August 1","Annual Revenue & Expense Schedule includes quarters 1-4 of prior calendar year, all paid through March."]
[]
["Health Plan:","Name or D/B/A of the reporting managed care plan."]
["PBP Identifier:","Specific Plan Benefit Package (PBP) ID"]
["Reporting Period:","Based upon the reporting periods identified above."]
{"$rows_left_out":81}
{"sheet":"DSNP Rev-Exp Summary","index":8,"n_rows":85,"n_cols":23,"rows_kept":85,"merged":[[6,3,6,6],[6,7,6,10],[6,11,6,14],[6,15,6,18],[6,19,6,22],[7,5,7,6],[7,9,7,10],[7,13,7,14],[7,17,7,18],[7,21,7,22],[8,5,8,6],[8,9,8,10],[8,13,8,14],[8,17,8,18],[8,21,8,22],[9,0,9,2],[9,5,9,6],[9,9,9,10],[9,13,9,14],[9,17,9,18],[9,21,9,22],[10,0,12,0],[10,5,10,6],[10,9,10,10],[10,13,10,14],[10,17,10,18],[10,21,10,22],[11,5,11,6],[11,9,11,10],[11,13,11,14],[11,17,11,18],[11,21,11,22],[12,5,12,6],[12,9,12,10],[12,13,12,14],[12,17,12,18],[12,21,12,22],[13,0,14,2],[13,3,13,6],[13,7,13,10],[13,11,13,14],[13,15,13,18],[13,19,13,22],[15,0,61,0],[62,0,65,0],[66,0,67,2],[66,3,66,6],[66,7,66,10],[66,11,66,14],[66,15,66,18],[66,19,66,22],[68,0,74,0],[75,0,80,0]]}
["DUAL SPECIAL NEEDS PLAN -- REVENUE AND EXPENSE SCHEDULE - SUMMARY"]
[]
["Health Plan:"]
["Reporting Period:"]
["Paid Through:"]
["Statewide"]
[{"$nulls":3},"JANUARY - MARCH (Q1)",{"$nulls":3},"APRIL - JUNE (Q2)",{"$nulls":3},"JULY - SEPTEMBER (Q3)",{"$nulls":3},"OCTOBER - DECEMBER (Q4)",{"$nulls":3},"TOTAL (TO DATE)"]
[{"$nulls":3},"DSNP \nTotal","QMB","Full Dual",null,"DSNP \nTotal","QMB","Full Dual",null,"DSNP \nTotal","QMB","Full Dual",null,"DSNP \nTotal","QMB","Full Dual",null,"DSNP \nTotal","QMB","Full Dual"]
["MEMBER MONTHS",null,null,{"$f":"SUM(E9:G9)","v":0},{"$f":"SUM(StartSum:EndSum!E10)","v":0},{"$f":"SUM(StartSum:EndSum!F10)","v":0},null,{"$f":"SUM(I9:K9)","v":0},{"$f":"SUM(StartSum:EndSum!I10)","v":0},{"$f":"SUM(StartSum:EndSum!J10)","v":0},null,{"$f":"SUM(M9:O9)","v":0},{"$f":"SUM(StartSum:EndSum!M10)","v":0},{"$f":"SUM(StartSum:EndSum!N10)","v":0},null,{"$f":"SUM(Q9:S9)","v":0},{"$f":"SUM(StartSum:EndSum!Q10)","v":0},{"$f":"SUM(StartSum:EndSum!R10)","v":0},null,{"$f":"SUM(U9:W9)","v":0},{"$f":"SUM(StartSum:EndSum!U10)","v":0},{"$f":"SUM(StartSum:EndSum!V10)","v":0}]
["REVENUES"]
{"$rows_left_out":76}
{"sheet":"StartSum","index":9,"n_rows":0,"n_cols":0,"rows_kept":0,"hidden":true}

{"sheet":"DSNP Rev-Exp Rest of Florida","index":10,"n_rows":67,"n_cols":23,"rows_kept":67,"hidden":true,"merged":[[7,3,7,6],[7,7,7,10],[7,11,7,14],[7,15,7,18],[7,19,7,22],[8,5,8,6],[8,9,8,10],[8,13,8,14],[8,17,8,18],[8,21,8,22],[9,5,9,6],[9,9,9,10],[9,13,9,14],[9,17,9,18],[9,21,9,22],[10,0,10,2],[10,5,10,6],[10,9,10,10],[10,13,10,14],[10,17,10,18],[10,21,10,22],[11,0,13,0],[11,5,11,6],[11,9,11,10],[11,13,11,14],[11,17,11,18],[11,21,11,22],[12,5,12,6],[12,9,12,10],[12,13,12,14],[12,17,12,18],[12,21,12,22],[13,5,13,6],[13,9,13,10],[13,13,13,14],[13,17,13,18],[13,21,13,22],[14,0,15,2],[14,3,14,6],[14,7,14,10],[14,11,14,14],[14,15,14,18],[14,19,14,22],[16,0,62,0],[63,0,66,0]]}
["DUAL SPECIAL NEEDS PLAN -- REVENUE AND EXPENSE SCHEDULE - REST OF FLORIDA"]
[]
["Health Plan:",null,{"$f":"'DSNP Rev-Exp Summary'!C3","v":0}]
["PBP Identifier:"]
["Reporting Period:",null,{"$f":"IF('DSNP Rev-Exp Summary'!C4=0,\"\",'DSNP Rev-Exp Summary'!C4)","v":""}]
["Paid Through:",null,{"$f":"IF('DSNP Rev-Exp Summary'!C5=0,\"\",'DSNP Rev-Exp Summary'!C5)","v":""}]
["Rest of Florida"]
[{"$nulls":3},"JANUARY - MARCH (Q1)",{"$nulls":3},"APRIL - JUNE (Q2)",{"$nulls":3},"JULY - SEPTEMBER (Q3)",{"$nulls":3},"OCTOBER - DECEMBER (Q4)",{"$nulls":3},"TOTAL (TO DATE)"]
[{"$nulls":3},"DSNP \nTotal","QMB","Full Dual",null,"DSNP \nTotal","QMB","Full Dual",null,"DSNP \nTotal","QMB","Full Dual",null,"DSNP \nTotal","QMB","Full Dual",null,"DSNP \nTotal","QMB","Full Dual"]
["MEMBER MONTHS",null,null,{"$f":"SUM(E10:G10)","v":0},{"$nulls":3},{"$f":"SUM(I10:K10)","v":0},{"$nulls":3},{"$f":"SUM(M10:O10)","v":0},{"$nulls":3},{"$f":"SUM(Q10:S10)","v":0},{"$nulls":3},{"$f":"SUM(U10:V10)","v":0},{"$f":"E10+I10+M10+Q10","v":0},{"$f":"F10+J10+N10+R10","v":0}]
{"$rows_left_out":58}
{"sheet":"DSNP Rev-Exp Region 9","index":11,"n_rows":67,"n_cols":23,"rows_kept":67,"hidden":true,"merged":[[7,3,7,6],[7,7,7,10],[7,11,7,14],[7,15,7,18],[7,19,7,22],[8,5,8,6],[8,9,8,10],[8,13,8,14],[8,17,8,18],[8,21,8,22],[9,5,9,6],[9,9,9,10],[9,13,9,14],[9,17,9,18],[9,21,9,22],[10,0,10,2],[10,5,10,6],[10,9,10,10],[10,13,10,14],[10,17,10,18],[10,21,10,22],[11,0,13,0],[11,5,11,6],[11,9,11,10],[11,13,11,14],[11,17,11,18],[11,21,11,22],[12,5,12,6],[12,9,12,10],[12,13,12,14],[12,17,12,18],[12,21,12,22],[13,5,13,6],[13,9,13,10],[13,13,13,14],[13,17,13,18],[13,21,13,22],[14,0,15,2],[14,3,14,6],[14,7,14,10],[14,11,14,14],[14,15,14,18],[14,19,14,22],[16,0,62,0],[63,0,66,0]]}
["DUAL SPECIAL NEEDS PLAN -- REVENUE AND EXPENSE SCHEDULE - REGION 9"]
[]
["Health Plan:",null,{"$f":"'DSNP Rev-Exp Summary'!C3","v":0}]
["PBP Identifier:"]
["Reporting Period:",null,{"$f":"IF('DSNP Rev-Exp Summary'!C4=0,\"\",'DSNP Rev-Exp Summary'!C4)","v":""}]
["Paid Through:",null,{"$f":"IF('DSNP Rev-Exp Summary'!C5=0,\"\",'DSNP Rev-Exp Summary'!C5)","v":""}]
["Region 9"]
[{"$nulls":3},"JANUARY - MARCH (Q1)",{"$nulls":3},"APRIL - JUNE (Q2)",{"$nulls":3},"JULY - SEPTEMBER (Q3)",{"$nulls":3},"OCTOBER - DECEMBER (Q4)",{"$nulls":3},"TOTAL (TO DATE)"]
[{"$nulls":3},"DSNP \nTotal","QMB","Full Dual",null,"DSNP \nTotal","QMB","Full Dual",null,"DSNP \nTotal","QMB","Full Dual",null,"DSNP \nTotal","QMB","Full Dual",null,"DSNP \nTotal","QMB","Full Dual"]
["MEMBER MONTHS",null,null,{"$f":"SUM(E10:G10)","v":0},{"$nulls":3},{"$f":"SUM(I10:K10)","v":0},{"$nulls":3},{"$f":"SUM(M10:O10)","v":0},{"$nulls":3},{"$f":"SUM(Q10:S10)","v":0},{"$nulls":3},{"$f":"SUM(U10:V10)","v":0},{"$f":"E10+I10+M10+Q10","v":0},{"$f":"F10+J10+N10+R10","v":0}]
{"$rows_left_out":58}
{"sheet":"DSNP Rev-Exp Region 10","index":12,"n_rows":67,"n_cols":23,"rows_kept":67,"hidden":true,"merged":[[7,3,7,6],[7,7,7,10],[7,11,7,14],[7,15,7,18],[7,19,7,22],[8,5,8,6],[8,9,8,10],[8,13,8,14],[8,17,8,18],[8,21,8,22],[9,5,9,6],[9,9,9,10],[9,13,9,14],[9,17,9,18],[9,21,9,22],[10,0,10,2],[10,5,10,6],[10,9,10,10],[10,13,10,14],[10,17,10,18],[10,21,10,22],[11,0,13,0],[11,5,11,6],[11,9,11,10],[11,13,11,14],[11,17,11,18],[11,21,11,22],[12,5,12,6],[12,9,12,10],[12,13,12,14],[12,17,12,18],[12,21,12,22],[13,5,13,6],[13,9,13,10],[13,13,13,14],[13,17,13,18],[13,21,13,22],[14,0,15,2],[14,3,14,6],[14,7,14,10],[14,11,14,14],[14,15,14,18],[14,19,14,22],[16,0,62,0],[63,0,66,0]]}
["DUAL SPECIAL NEEDS PLAN -- REVENUE AND EXPENSE SCHEDULE - REGION 10"]
[]
["Health Plan:",null,{"$f":"'DSNP Rev-Exp Summary'!C3","v":0}]
["PBP Identifier:"]
["Reporting Period:",null,{"$f":"IF('DSNP Rev-Exp Summary'!C4=0,\"\",'DSNP Rev-Exp Summary'!C4)","v":""}]
["Paid Through:",null,{"$f":"IF('DSNP Rev-Exp Summary'!C5=0,\"\",'DSNP Rev-Exp Summary'!C5)","v":""}]
["Region 10"]
[{"$nulls":3},"JANUARY - MARCH (Q1)",{"$nulls":3},"APRIL - JUNE (Q2)",{"$nulls":3},"JULY - SEPTEMBER (Q3)",{"$nulls":3},"OCTOBER - DECEMBER (Q4)",{"$nulls":3},"TOTAL (TO DATE)"]
[{"$nulls":3},"DSNP \nTotal","QMB","Full Dual",null,"DSNP \nTotal","QMB","Full Dual",null,"DSNP \nTotal","QMB","Full Dual",null,"DSNP \nTotal","QMB","Full Dual",null,"DSNP \nTotal","QMB","Full Dual"]
["MEMBER MONTHS",null,null,{"$f":"SUM(E10:G10)","v":0},{"$nulls":3},{"$f":"SUM(I10:K10)","v":0},{"$nulls":3},{"$f":"SUM(M10:O10)","v":0},{"$nulls":3},{"$f":"SUM(Q10:S10)","v":0},{"$nulls":3},{"$f":"SUM(U10:V10)","v":0},{"$f":"E10+I10+M10+Q10","v":0},{"$f":"F10+J10+N10+R10","v":0}]
{"$rows_left_out":58}
{"sheet":"DSNP Rev-Exp Region 11","index":13,"n_rows":67,"n_cols":23,"rows_kept":67,"hidden":true,"merged":[[7,3,7,6],[7,7,7,10],[7,11,7,14],[7,15,7,18],[7,19,7,22],[8,5,8,6],[8,9,8,10],[8,13,8,14],[8,17,8,18],[8,21,8,22],[9,5,9,6],[9,9,9,10],[9,13,9,14],[9,17,9,18],[9,21,9,22],[10,0,10,2],[10,5,10,6],[10,9,10,10],[10,13,10,14],[10,17,10,18],[10,21,10,22],[11,0,13,0],[11,5,11,6],[11,9,11,10],[11,13,11,14],[11,17,11,18],[11,21,11,22],[12,5,12,6],[12,9,12,10],[12,13,12,14],[12,17,12,18],[12,21,12,22],[13,5,13,6],[13,9,13,10],[13,13,13,14],[13,17,13,18],[13,21,13,22],[14,0,15,2],[14,3,14,6],[14,7,14,10],[14,11,14,14],[14,15,14,18],[14,19,14,22],[16,0,62,0],[63,0,66,0]]}
["DUAL SPECIAL NEEDS PLAN -- REVENUE AND EXPENSE SCHEDULE - REGION 11"]
[]
["Health Plan:",null,{"$f":"'DSNP Rev-Exp Summary'!C3","v":0}]
["PBP Identifier:"]
["Reporting Period:",null,{"$f":"IF('DSNP Rev-Exp Summary'!C4=0,\"\",'DSNP Rev-Exp Summary'!C4)","v":""}]
["Paid Through:",null,{"$f":"IF('DSNP Rev-Exp Summary'!C5=0,\"\",'DSNP Rev-Exp Summary'!C5)","v":""}]
["Region 11"]
[{"$nulls":3},"JANUARY - MARCH (Q1)",{"$nulls":3},"APRIL - JUNE (Q2)",{"$nulls":3},"JULY - SEPTEMBER (Q3)",{"$nulls":3},"OCTOBER - DECEMBER (Q4)",{"$nulls":3},"TOTAL (TO DATE)"]
[{"$nulls":3},"DSNP \nTotal","QMB","Full Dual",null,"DSNP \nTotal","QMB","Full Dual",null,"DSNP \nTotal","QMB","Full Dual",null,"DSNP \nTotal","QMB","Full Dual",null,"DSNP \nTotal","QMB","Full Dual"]
["MEMBER MONTHS",null,null,{"$f":"SUM(E10:G10)","v":0},{"$nulls":3},{"$f":"SUM(I10:K10)","v":0},{"$nulls":3},{"$f":"SUM(M10:O10)","v":0},{"$nulls":3},{"$f":"SUM(Q10:S10)","v":0},{"$nulls":3},{"$f":"SUM(U10:V10)","v":0},{"$f":"E10+I10+M10+Q10","v":0},{"$f":"F10+J10+N10+R10","v":0}]
{"$rows_left_out":58}
{"sheet":"EndSum","index":14,"n_rows":0,"n_cols":0,"rows_kept":0,"hidden":true}

{"sheet":"DSNP Admin Summary","index":15,"n_rows":116,"n_cols":22,"rows_kept":116,"merged":[[7,0,7,6],[8,0,8,22],[9,0,10,2],[9,3,9,6],[9,7,9,10],[9,11,9,14],[9,15,9,18],[9,19,9,22],[11,0,17,0],[18,0,23,0],[30,0,30,22],[31,0,32,2],[31,3,31,6],[31,7,31,10],[31,11,31,14],[31,15,31,18],[31,19,31,22],[33,0,39,0],[40,0,45,0],[52,0,52,22],[53,0,54,2],[53,3,53,6],[53,7,53,10],[53,11,53,14],[53,15,53,18],[53,19,53,22],[55,0,61,0],[62,0,67,0],[74,0,74,22],[75,0,76,2],[75,3,75,6],[75,7,75,10],[75,11,75,14],[75,15,75,18],[75,19,75,22],[77,0,83,0],[84,0,89,0],[96,0,96,22],[97,0,98,2],[97,3,97,6],[97,7,97,10],[97,11,97,14],[97,15,97,18],[97,19,97,22],[99,0,105,0],[106,0,111,0]]}
["DUAL SPECIAL NEEDS PLAN -- ADMINISTRATIVE EXPENSE SCHEDULE - PLAN SUMMARY"]
[]
["Health Plan:",null,{"$f":"'DSNP Rev-Exp Summary'!C3","v":0}]
["Reporting Period:",null,{"$f":"'DSNP Rev-Exp Summary'!C4","v":0}]
["Paid Through:",null,{"$f":"'DSNP Rev-Exp Summary'!C5","v":0}]
["Statewide"]
[]
["Note: Refer to the Instructions tabs for the DSNP Revenue and Expense Schedule for a detailed explaination of each category."]
["SOUTH FLORIDA -  REGION 9"]
["Administrative Expenses, Government-Mandated Assessments, Taxes, and Fees ",null,null,"JANUARY - MARCH (Q1)",{"$nulls":3},"APRIL - JUNE (Q2)",{"$nulls":3},"JULY - SEPTEMBER (Q3)",{"$nulls":3},"OCTOBER - DECEMBER (Q4)",{"$nulls":3},"TOTAL (TO DATE)"]
{"$rows_left_out":107}
{"sheet":"DSNP Subcap Summary","index":16,"n_rows":104,"n_cols":14,"rows_kept":104,"merged":[[7,0,8,2],[7,3,8,4],[7,5,8,6],[7,7,8,8],[7,9,8,10],[7,11,8,11],[7,12,8,13],[11,0,17,0],[18,0,24,0],[25,0,46,0],[47,0,53,0],[54,0,60,0],[61,0,67,0],[68,0,74,0],[75,0,81,0],[82,0,88,0],[89,0,95,0],[96,0,102,0]]}
["DUAL SPECIAL NEEDS PLAN -- SUBCAPITATION SCHEDULE - PLAN SUMMARY"]
[]
["Health Plan:",null,{"$f":"'DSNP Rev-Exp Summary'!C3","v":0}]
["Reporting Period:",null,{"$f":"'DSNP Rev-Exp Summary'!C4","v":0}]
["Paid Through:",null,{"$f":"'DSNP Rev-Exp Summary'!C5","v":0}]
["Statewide"]
[]
[{"$nulls":3},"JANUARY - MARCH (Q1)",null,"APRIL - JUNE (Q2)",null,"JULY - SEPTEMBER (Q3)",null,"OCTOBER - DECEMBER (Q4)",null,"Prior Year Adjustments","TOTAL (TO DATE)"]
[]
[{"$nulls":3},"MM","Amount","MM","Amount","MM","Amount","MM","Amount","Amount","MM","Amount"]
{"$rows_left_out":95}
{"sheet":"Notes","index":17,"n_rows":16,"n_cols":6,"rows_kept":16}
["Notes - Other Revenue"]
[]
[]
["DSNP Rev-Exp Line 1.2 - Other Revenue (add rows as needed)"]
["Description ","Q1","Q2","Q3","Q4","Total (To Date)"]
[{"$nulls":5},{"$f":"SUM(B6:E6)","v":0}]
[{"$nulls":5},0]
[{"$nulls":5},0]
[{"$nulls":5},0]
[{"$nulls":5},0]
{"$rows_left_out":6}